John deere 450g dozer for sale

May 18, 2015 · Hi. Just letting you know that everything is working with the version @danoli3 recommended (both the apothecary one and the new master branch). I just added the ofxOpenCV source to my project, added the opencv include file to the header search path and then added all opencv libraries (the .a files) to the “link binary with libraries” in the build phases.

Yes or no button in bootstrap

#!/bin/bash # XCodeLegacy.sh # # Original author: Frederic Devernay # Contributors: # - Garrett Walbridge # - Jae Liu # - Eric Knibbe # - Chris Roueche # - Kris ...

2019年11月28日 iOSでステータスバーのテキストの色を変更する方法 2019年11月26日 Xcode11での「Command CompileSwiftSources failed with a nonzero exit code」解消方法 2019年11月26日 「’NSUnknownKeyException’, reason: … this class is not key value coding-compliant for the key X」エラーを直す方法
Shift + Command + K & Option + Shift + Command + K. Tagged with xcode, ios. DEV is a community of 532,251 amazing developers. We're a place where coders share, stay up-to-date and grow their careers.
专栏首页 freesan44 Command PhaseScriptExecution failed with a nonzero exit code ... 53289524/xcode-10-2-1-command-phasescriptexecution ... 题 16.11. 跳水板
Command PhaseScriptExecution failed with a nonzero exit codeの原因がまばらなので、調査して1つずつ試す他なかった。また同様にエラーが発生した時、この記事に追記していきたい。
ld: in / Users / Objects-normal / x86_64 / TWRAppDelegate. o, file too small for architecture x86_64 clang: error: linker command failed with exit code 1 (use -v to see invocation) 잘되다 갑자기 linker command failed with exit code 1 에러가 뜬다면. Product -> Clean을 하시고 다시 빌드해보세요~
ld: 1 duplicate symbol for architecture i386 clang: error: linker command failed with exit code 1 2014-05-30 symbol ios command debug clang iOS 安装MySQL-python报错error: command 'gcc' failed with exit status 1
Jul 17, 2019 · How to Install Command Line Tools in Mac OS X (Without Xcode) Mac users who prefer to have a more traditional Unix toolkit accessible to them through the Terminal may wish to install the optional Command Line Tools subsection of the Xcode IDE.
J'essaye de recompiler un petit programme via XCODE 11 or il "bugue" avec ce message : "Command CodeSign failed with a nonzero exit code" Cependant, il compile correctement et me permet de lancer l'exécutable hors Xcode.
ld: library not found for -lQCARclang: error: linker command failed with exit code 1 (use -v to see invocation)(null): Library not found for -lQCAR
Linker command failed with exit code 1 現在C++をベースにした openFrameworks というライブラリを用いて開発していますが、たまにこのエラーに遭遇します。 また、このエラー自体は swift や Objective-C を使った開発でも見かけたことがありますので、Xcodeのエラーだと思わ ...
Xcode 11.1 -no identity found Command PhaseScriptExecution failed with a nonzero exit code Hot Network Questions Private Pilot Compensation
Hemi mds delete tuner
  • Oct 13, 2019 · Undefined symbols for architecture x86_64: "___isOSVersionAtLeast", referenced from: _FIRInstanceIDCurrentLocale in FirebaseInstanceID(FIRInstanceIDUtilities.o) ld: symbol(s) not found for architecture x86_64 clang-7: error: linker command failed with exit code 1 (use -v to see invocation)
  • XcodeでBuildしようとすると、 Command PhaseScriptExecution failed with a nonzero exit code. と表示されBuildエラーになってしまいます。 Carthageでライブラリを管理しているのですが、おそらくこれが影響しているかと思います。
  • I received 4 errors like the previous referred to "zrtp". I also received the message "ld: symbol(s) not found for architecture i386. clang: error: linker command failed with exit code 1 (use -v to see invocation)"
  • 1. status has two bytes: in the left we have the exit code of the child and in the right byte just 0. 2. if the child was terminated due to a signal, then the last 7 bits
  • 環境: OS Lion Xcode 4.2 and iOS 5 SDK beta 4 SDK4で開発してたプロジェクトがビルド出来なくなりました。 ... platform/Developer/usr/bin ...

Hello I need to use the quanteda package to analyse text for my studies. I am quite new to R studio and would appreciate your help. I am trying to install the package with: install.packages("quanteda") The answer code I get is the following: Warning in install.packages : dependency 'statnet.common' is not available also installing the dependencies 'sna', 'proxyC' There are binary versions ...

WebRTC 开发(七)升级 Xcode 11 后 AppRTCMobile 编译报错的解决方案 发表于 2019-10-28 分类于 WebRTC 阅读次数: 将 Xcode 升级到 Xcode 11.1 版本后,工程 AppRTCMobile 编译报错 “code object is not signed at all”。 I am supposed to make a program that inputs user's name, birthdate, and grade (in percent) and display all of that with the grade (letter). It works perfectly fine, but I wanted to verify that the user's name didn't contain numbers. Now is when I get the errors. Here is my code (I am running this in XCode):
Reason for error Command CompileSwift failed with a nonzero exit code. Generally in Xcode, due to derived data and cache, many times issue arises. Xcode is also very popular in being slow and its hang issues. So you may not be sure that error is from your side or from another side or from Xcode itself.

Undefined symbols for architecture x86_64: "_OBJC_CLASS_$_MTLFunctionConstantValues", referenced from: objc-class-ref in MoltenVK(MoltenVK-x86_64-master.o) ld: symbol(s) not found for architecture x86_64 clang: error: linker command failed with exit code 1 (use -v to see invocation)

Pokemon omega ruby exp multiplier cheat codes

Command CompileSwift failed with a nonzero exit code in Xcode 10. 解决方案. 1.在项目中搜索关键词CommonCrypto. 2.如果有Pod依赖这个头文件,在podfile中移除掉这个Pod库,重新执行pod install. 3.clean and build项目。 4.重新添加刚才移除掉的Pod库到podfile文件。然后pod install项目。